BDBM50171140 CHEMBL3806014
SMILES COc1ccc2C(=O)\C(COc2c1)=C\c1cnc(nc1)N(C)C
InChI Key InChIKey=QDKJGFPTZSZHPZ-WUXMJOGZSA-N
Data  1 IC50
  Tab Delimited (TSV)   2D SDfile   Computed 3D by Vconf -m prep SDfile
Find this compound or compounds like it in BindingDB:
Activity Spreadsheet -- Enzyme Inhibition Constant Data from BindingDB
Found 1 hit for monomerid = 50171140
TargetAmine oxidase [flavin-containing] B(Homo sapiens (Human))
Universit£
Curated by ChEMBL
LigandPNGBDBM50171140(CHEMBL3806014)
Affinity DataIC50:  1.04E+4nM. Assay description: Inhibition of human recombinant microsomal MAO-B expressed in baculovirus infected BTI-TN-5B1-4 cells using p-tyramine as substrate assessed as reduc...
In DepthDetails ArticlePubMed