BDBM50171336 5-(1-Methoxy-butyl)-1-(4-methoxy-phenyl)-7-methyl-4,5-dihydro-1H,3H-1,2a,5,8-tetraaza-acenaphthylen-2-one::CHEMBL190757
SMILES CCCC(OC)N1CCn2c3c1cc(C)nc3n(-c1ccc(OC)cc1)c2=O
InChI Key InChIKey=LGPJBFIUKQJUBB-UHFFFAOYSA-N
Data  1 KI
  Tab Delimited (TSV)   2D SDfile   Computed 3D by Vconf -m prep SDfile
Find this compound or compounds like it in BindingDB:
Activity Spreadsheet -- Enzyme Inhibition Constant Data from BindingDB
Found 1 hit for monomerid = 50171336
TargetCorticotropin-releasing factor receptor 1(Homo sapiens (Human))
Neurocrine Biosciences
Curated by ChEMBL
LigandPNGBDBM50171336(5-(1-Methoxy-butyl)-1-(4-methoxy-phenyl)-7-methyl-...)
Affinity DataKi:  150nM. Assay description: Binding affinity for corticotropin-releasing factor-1 expressed in leukocyte tyrosine kinase cells
In DepthDetails ArticlePubMed