BDBM50171345 CHEMBL3805008
SMILES [O-][N+](=O)c1ccc(cc1C(F)(F)F)S(=O)(=O)N1CCCC(Cn2ccnc2)C1
InChI Key InChIKey=LDIREWUNLYZOAB-UHFFFAOYSA-N
Data  1 IC50
  Tab Delimited (TSV)   2D SDfile   Computed 3D by Vconf -m prep SDfile
Find this compound or compounds like it in BindingDB:
Activity Spreadsheet -- Enzyme Inhibition Constant Data from BindingDB
Found 1 hit for monomerid = 50171345
TargetAromatase(Homo sapiens (Human))
University Of Chieti 'G. D'Annunzio
Curated by ChEMBL
LigandPNGBDBM50171345(CHEMBL3805008)
Affinity DataIC50:  16nM. Assay description: Inhibition of recombinant human aromatase using 7-methoxy-4-trifluoromethyl coumarin as substrate measured at anoxic conditions by fluorescence analy...
In DepthDetails ArticlePubMed