BDBM50171609 6-(2-Isopropoxy-ethylamino)-[3,4']bipyridinyl-5-carboxylic acid (1-benzo[1,3]dioxol-5-ylmethyl-piperidin-4-yl)-amide::CHEMBL427006
SMILES CC(C)OCCNc1ncc(cc1C(=O)NC1CCN(Cc2ccc3OCOc3c2)CC1)-c1ccncc1
InChI Key InChIKey=VUKJLBVYYGLZME-UHFFFAOYSA-N
Data  1 IC50
  Tab Delimited (TSV)   2D SDfile   Computed 3D by Vconf -m prep SDfile
Find this compound or compounds like it in BindingDB:
Activity Spreadsheet -- Enzyme Inhibition Constant Data from BindingDB
Found 1 hit for monomerid = 50171609
TargetMelanin-concentrating hormone receptor 1(Homo sapiens (Human))
Abbott Laboratories
Curated by ChEMBL
LigandPNGBDBM50171609(6-(2-Isopropoxy-ethylamino)-[3,4']bipyridinyl-5-ca...)
Affinity DataIC50:  140nM. Assay description: Inhibitory activity towards melanin-concentrating hormone receptor 1 in IMR32 cells
In DepthDetails ArticlePubMed