BDBM50171849 CHEMBL3805668
SMILES Cc1ccccc1NC(=O)c1nnc(COc2ccc(CCC(O)=O)cc2)s1
InChI Key InChIKey=WDFOWNQAXFBUIL-UHFFFAOYSA-N
Data  1 EC50
  Tab Delimited (TSV)   2D SDfile   Computed 3D by Vconf -m prep SDfile
Find this compound or compounds like it in BindingDB:
Activity Spreadsheet -- Enzyme Inhibition Constant Data from BindingDB
Found 1 hit for monomerid = 50171849
TargetFree fatty acid receptor 1(Homo sapiens (Human))
Saint Petersburg State University
Curated by ChEMBL
LigandPNGBDBM50171849(CHEMBL3805668)
Affinity DataEC50:  1.52E+3nM. Assay description: Agonist activity at human GPR40 expressed in CHO cells by calcium influx assay
In DepthDetails ArticlePubMed