BDBM50172127 CHEMBL370879::Naphthalen-2-yl-(4-pyridin-2-ylethynyl-cyclohex-3-enyl)-amine
SMILES C1CC(=CCC1Nc1ccc2ccccc2c1)C#Cc1ccccn1
InChI Key InChIKey=GXNDHQVYOXLGFK-UHFFFAOYSA-N
Data  1 KI  2 IC50
  Tab Delimited (TSV)   2D SDfile   Computed 3D by Vconf -m prep SDfile
Find this compound or compounds like it in BindingDB:
Activity Spreadsheet -- Enzyme Inhibition Constant Data from BindingDB
Found 3 hits for monomerid = 50172127
TargetMetabotropic glutamate receptor 5(Rattus norvegicus (Rat))
Merck Research Laboratories
Curated by ChEMBL
LigandPNGBDBM50172127(CHEMBL370879 | Naphthalen-2-yl-(4-pyridin-2-ylethy...)
Affinity DataKi:  304nM. Assay description: Displacement of [3H]-3-methoxy-5-(pyridin-2-ylethynyl)pyridine from mGlu5 receptor of rat cortical membrane
In DepthDetails ArticlePubMed
TargetMetabotropic glutamate receptor 5(Homo sapiens (Human))
Merck Research Laboratories
Curated by ChEMBL
LigandPNGBDBM50172127(CHEMBL370879 | Naphthalen-2-yl-(4-pyridin-2-ylethy...)
Affinity DataIC50:  306nM. Assay description: In vitro inhibitory concentration against Ca+2 flux mediated by human mGlu5 receptor expressed in Ltk cells using fura-2 dye
In DepthDetails ArticlePubMed
TargetCytochrome P450 1A2(Homo sapiens (Human))
Merck Research Laboratories
Curated by ChEMBL
LigandPNGBDBM50172127(CHEMBL370879 | Naphthalen-2-yl-(4-pyridin-2-ylethy...)
Affinity DataIC50: >2.00E+4nM. Assay description: Inhibitory concentration against CYP1A2 using recombinant CYP450 under Gentest-based protocol
In DepthDetails ArticlePubMed