BDBM50172299 3-(S)-1-Pyrrolidin-2-ylmethyl-1-(toluene-4-sulfonyl)-1H-indole::CHEMBL365993
SMILES Cc1ccc(cc1)S(=O)(=O)n1cc(C[C@@H]2CCCN2)c2ccccc12
InChI Key InChIKey=KETDTKLZMBDRGZ-KRWDZBQOSA-N
Data  1 KI
  Tab Delimited (TSV)   2D SDfile   Computed 3D by Vconf -m prep SDfile
Find this compound or compounds like it in BindingDB:
Activity Spreadsheet -- Enzyme Inhibition Constant Data from BindingDB
Found 1 hit for monomerid = 50172299
Target5-hydroxytryptamine receptor 6(Homo sapiens (Human))
Wyeth Research
Curated by ChEMBL
LigandPNGBDBM50172299(3-(S)-1-Pyrrolidin-2-ylmethyl-1-(toluene-4-sulfony...)
Affinity DataKi:  33nM. Assay description: Displacement of [3H]-LSD from cloned human 5-hydroxytryptamine 6 receptor expressed in HeLa cells
In DepthDetails ArticlePubMed