BDBM50172521 CHEMBL3809850
SMILES CC(C)[C@@](O)(C(=O)N1CCC(CC1)C1CCN(CC1)c1ccc(C(=O)N(C)C)c(Cl)c1)C(F)(F)F
InChI Key InChIKey=POYRTHYMXFSQBJ-XMMPIXPASA-N
Data  3 EC50
PDB links: 2 PDB IDs match this monomer.
  Tab Delimited (TSV)   2D SDfile   Computed 3D by Vconf -m prep SDfile
Find this compound or compounds like it in BindingDB:
Activity Spreadsheet -- Enzyme Inhibition Constant Data from BindingDB
Found 3 hits for monomerid = 50172521
TargetOxysterols receptor LXR-alpha(Homo sapiens (Human))
Wuxi Apptec
Curated by ChEMBL
LigandPNGBDBM50172521(CHEMBL3809850)
Affinity DataEC50:  830nM. Assay description: Partial agonist activity at LXRalpha (unknown origin) expressed in human HepG2 cells co-expressing ABCA1 promoter measured after 48 hrs by cell-based...
TargetOxysterols receptor LXR-beta(Homo sapiens (Human))
Wuxi Apptec
Curated by ChEMBL
LigandPNGBDBM50172521(CHEMBL3809850)
Affinity DataEC50:  30nM. Assay description: Agonist activity at GST-tagged LXRbeta-LBD (unknown origin) by LanthaScreen TR-FRET liver X receptor coactivator assay
TargetOxysterols receptor LXR-alpha(Homo sapiens (Human))
Wuxi Apptec
Curated by ChEMBL
LigandPNGBDBM50172521(CHEMBL3809850)
Affinity DataEC50:  420nM. Assay description: Partial agonist activity at GST-tagged LXRalpha-LBD (unknown origin) by LanthaScreen TR-FRET liver X receptor coactivator assay