BDBM50172797 CHEMBL3809154
SMILES COC(=O)CNC(=O)CNC(=O)OCc1ccccc1
InChI Key InChIKey=TXMIOBGEEHTBRF-UHFFFAOYSA-N
Data  2 IC50
  Tab Delimited (TSV)   2D SDfile   Computed 3D by Vconf -m prep SDfile
Find this compound or compounds like it in BindingDB:
Activity Spreadsheet -- Enzyme Inhibition Constant Data from BindingDB
Found 2 hits for monomerid = 50172797
TargetProstaglandin G/H synthase 1(Ovis aries (Sheep))
Guru Nanak Dev University
Curated by ChEMBL
LigandPNGBDBM50172797(CHEMBL3809154)
Affinity DataIC50: >1.00E+4nM. Assay description: Inhibition of ovine COX1 assessed as reduction in PGH2-derived PGF2alpha using arachidonic acid as substrate preincubated for 10 mins followed by sub...
In DepthDetails ArticlePubMed
TargetProstaglandin G/H synthase 2(Homo sapiens (Human))
Guru Nanak Dev University
Curated by ChEMBL
LigandPNGBDBM50172797(CHEMBL3809154)
Affinity DataIC50:  1.00E+3nM. Assay description: Inhibition of human recombinant COX2 assessed as reduction in PGH2-derived PGF2alpha using arachidonic acid as substrate preincubated for 10 mins fol...
In DepthDetails ArticlePubMed