BDBM50172847 CHEMBL194670::[2-(5-Chloro-2-[1,2,4]triazol-1-yl-benzyl)-oxazolo[4,5-c]pyridin-4-yl]-{2-[1-(2,2,2-trifluoro-ethyl)-piperidin-2-yl]-ethyl}-amine
SMILES FC(F)(F)CN1CCCCC1CCNc1nccc2oc(Cc3cc(Cl)ccc3-n3cncn3)nc12
InChI Key InChIKey=GFXFOCFFDUYUAQ-UHFFFAOYSA-N
Data  4 KI
  Tab Delimited (TSV)   2D SDfile   Computed 3D by Vconf -m prep SDfile
Find this compound or compounds like it in BindingDB:
Activity Spreadsheet -- Enzyme Inhibition Constant Data from BindingDB
Found 4 hits for monomerid = 50172847
TargetProthrombin(Homo sapiens (Human))
Merck Research Laboratories
Curated by ChEMBL
LigandPNGBDBM50172847(CHEMBL194670 | [2-(5-Chloro-2-[1,2,4]triazol-1-yl-...)
Affinity DataKi:  4.60nM. Assay description: Inhibitory constant against thrombin
In DepthDetails ArticlePubMed
TargetSerine protease 1/Trypsin-2(Homo sapiens (Human))
Merck Research Laboratories
Curated by ChEMBL
LigandPNGBDBM50172847(CHEMBL194670 | [2-(5-Chloro-2-[1,2,4]triazol-1-yl-...)
Affinity DataKi:  6.90nM. Assay description: Inhibitory constant against trypsin
In DepthDetails ArticlePubMed
TargetCoagulation factor X(Homo sapiens (Human))
Merck Research Laboratories
Curated by ChEMBL
LigandPNGBDBM50172847(CHEMBL194670 | [2-(5-Chloro-2-[1,2,4]triazol-1-yl-...)
Affinity DataKi:  54nM. Assay description: Inhibitory constant against human Coagulation factor Xa
In DepthDetails ArticlePubMed
TargetTissue-type plasminogen activator(Homo sapiens (Human))
Merck Research Laboratories
Curated by ChEMBL
LigandPNGBDBM50172847(CHEMBL194670 | [2-(5-Chloro-2-[1,2,4]triazol-1-yl-...)
Affinity DataKi:  3.50E+3nM. Assay description: Inhibitory constant of the compound against tissue plasminogen activator
In DepthDetails ArticlePubMed