BDBM50172864 6-Fluoro-pyridine-2-carboxylic acid {4-[4-(2,3-dichloro-phenyl)-piperazin-1-yl]-butyl}-amide::CHEMBL197195
SMILES Fc1cccc(n1)C(=O)NCCCCN1CCN(CC1)c1cccc(Cl)c1Cl
InChI Key InChIKey=HZYGVALVFFNNGE-UHFFFAOYSA-N
Data  6 KI
  Tab Delimited (TSV)   2D SDfile   Computed 3D by Vconf -m prep SDfile
Find this compound or compounds like it in BindingDB:
Activity Spreadsheet -- Enzyme Inhibition Constant Data from BindingDB
Found 6 hits for monomerid = 50172864
TargetD(3) dopamine receptor(Homo sapiens (Human))
University Of Erlangen-Nuremberg
Curated by ChEMBL
LigandPNGBDBM50172864(6-Fluoro-pyridine-2-carboxylic acid {4-[4-(2,3-dic...)
Affinity DataKi:  9nM. Assay description: Binding affinity towards Dopamine receptor D3 using CHO cell line and [3H]-spiperone as radioligand
In DepthDetails ArticlePubMed
Target5-hydroxytryptamine receptor 1A(Homo sapiens (Human))
University Of Erlangen-Nuremberg
Curated by ChEMBL
LigandPNGBDBM50172864(6-Fluoro-pyridine-2-carboxylic acid {4-[4-(2,3-dic...)
Affinity DataKi:  30nM. Assay description: Binding affinity towards 5-HT1A receptor using porcine cortical membraneand [3H]-8-OH-DPAT as radioligand
In DepthDetails ArticlePubMed
TargetD(2) dopamine receptor(Homo sapiens (Human))
University Of Erlangen-Nuremberg
Curated by ChEMBL
LigandPNGBDBM50172864(6-Fluoro-pyridine-2-carboxylic acid {4-[4-(2,3-dic...)
Affinity DataKi:  44nM. Assay description: Binding affinity towards Dopamine D2L receptor using CHO cell line and [3H]-spiperone as radioligand
In DepthDetails ArticlePubMed
TargetD(2) dopamine receptor(Homo sapiens (Human))
University Of Erlangen-Nuremberg
Curated by ChEMBL
LigandPNGBDBM50172864(6-Fluoro-pyridine-2-carboxylic acid {4-[4-(2,3-dic...)
Affinity DataKi:  57nM. Assay description: Binding affinity towards Dopamine D2S receptor using CHO cell line and [3H]-spiperone as radioligand
In DepthDetails ArticlePubMed
TargetD(4) dopamine receptor(Homo sapiens (Human))
University Of Erlangen-Nuremberg
Curated by ChEMBL
LigandPNGBDBM50172864(6-Fluoro-pyridine-2-carboxylic acid {4-[4-(2,3-dic...)
Affinity DataKi:  97nM. Assay description: Binding affinity towards Dopamine receptor D 4.4 using CHO cell line and [3H]-spiperone as radioligand
In DepthDetails ArticlePubMed
TargetD(1A) dopamine receptor(Sus scrofa)
University Of Erlangen-Nuremberg
Curated by ChEMBL
LigandPNGBDBM50172864(6-Fluoro-pyridine-2-carboxylic acid {4-[4-(2,3-dic...)
Affinity DataKi:  910nM. Assay description: Binding affinity towards Dopamine receptor D1 using porcine striatal membrane and [3H]-SCH- 23390 as radioligand
In DepthDetails ArticlePubMed