BDBM50172932 5-chloro-N'-(2-chlorophenylsulfonyl)-1H-indole-2-carbohydrazide::CHEMBL427030
SMILES Clc1ccc2[nH]c(cc2c1)C(=O)NNS(=O)(=O)c1ccccc1Cl
InChI Key InChIKey=IZYLAGKQCFJFQX-UHFFFAOYSA-N
Data  1 IC50
  Tab Delimited (TSV)   2D SDfile   Computed 3D by Vconf -m prep SDfile
Find this compound or compounds like it in BindingDB:
Activity Spreadsheet -- Enzyme Inhibition Constant Data from BindingDB
Found 1 hit for monomerid = 50172932
TargetBranched-chain-amino-acid aminotransferase, cytosolic(Homo sapiens (Human))
Pfizer
Curated by ChEMBL
LigandPNGBDBM50172932(5-chloro-N'-(2-chlorophenylsulfonyl)-1H-indole-2-c...)
Affinity DataIC50:  5.70E+3nM. Assay description: Inhibition of human BCATc
In DepthDetails ArticlePubMed