BDBM50172943 5-chloro-N'-(o-tolylsulfonyl)-1H-indole-2-carbohydrazide::CHEMBL207636
SMILES Cc1ccccc1S(=O)(=O)NNC(=O)c1cc2cc(Cl)ccc2[nH]1
InChI Key InChIKey=VIWWOGDYLRQLOO-UHFFFAOYSA-N
Data  1 IC50
  Tab Delimited (TSV)   2D SDfile   Computed 3D by Vconf -m prep SDfile
Find this compound or compounds like it in BindingDB:
Activity Spreadsheet -- Enzyme Inhibition Constant Data from BindingDB
Found 1 hit for monomerid = 50172943
TargetBranched-chain-amino-acid aminotransferase, cytosolic(Homo sapiens (Human))
Pfizer
Curated by ChEMBL
LigandPNGBDBM50172943(5-chloro-N'-(o-tolylsulfonyl)-1H-indole-2-carbohyd...)
Affinity DataIC50:  1.16E+3nM. Assay description: Inhibition of human BCATc
In DepthDetails ArticlePubMed