BDBM50173028 4-(4-(4-(benzyloxy)phenylamino)phthalazin-1-yl)benzamide::4-[4-(4-Benzyloxy-phenylamino)-phthalazin-1-yl]-benzamide::CHEMBL197357
SMILES NC(=O)c1ccc(cc1)-c1nnc(Nc2ccc(OCc3ccccc3)cc2)c2ccccc12
InChI Key InChIKey=UPMAOTVCKCIDRZ-UHFFFAOYSA-N
Data  2 IC50
  Tab Delimited (TSV)   2D SDfile   Computed 3D by Vconf -m prep SDfile
Find this compound or compounds like it in BindingDB:
Activity Spreadsheet -- Enzyme Inhibition Constant Data from BindingDB
Found 2 hits for monomerid = 50173028
TargetVascular endothelial growth factor receptor 2(Homo sapiens (Human))
Imclone Systems
Curated by ChEMBL
LigandPNGBDBM50173028(4-(4-(4-(benzyloxy)phenylamino)phthalazin-1-yl)ben...)
Affinity DataIC50: >1.00E+4nM. Assay description: Inhibition of VEGFR2 (unknown origin) by HTRF method
In DepthDetails ArticlePubMed
TargetVascular endothelial growth factor receptor 2(Homo sapiens (Human))
Imclone Systems
Curated by ChEMBL
LigandPNGBDBM50173028(4-(4-(4-(benzyloxy)phenylamino)phthalazin-1-yl)ben...)
Affinity DataIC50: >1.00E+4nM. Assay description: Inhibition of Vascular endothelial growth factor receptor 2 kinase phosphorylation of pGAT-biotin peptide
In DepthDetails ArticlePubMed