BDBM50173124 CHEMBL3809888
SMILES CN1CCN(Cc2ccc(cc2)C(=O)Nc2cc(n[nH]2)-c2ccc(NC(=O)Nc3cccc(F)c3)c(C)c2)CC1
InChI Key InChIKey=XHSBGOCHLWEZIE-UHFFFAOYSA-N
Data  1 IC50
  Tab Delimited (TSV)   2D SDfile   Computed 3D by Vconf -m prep SDfile
Find this compound or compounds like it in BindingDB:
Activity Spreadsheet -- Enzyme Inhibition Constant Data from BindingDB
Found 1 hit for monomerid = 50173124
TargetALK tyrosine kinase receptor(Homo sapiens (Human))
National Health Research Institutes
Curated by ChEMBL
LigandPNGBDBM50173124(CHEMBL3809888)
Affinity DataIC50:  6.20E+3nM. Assay description: Inhibition of human ALK (1084 to 1410 residues) expressed in baculovirus infected Sf21 insect cells using polyGlu4:Tyr peptide as substrate after 1 h...
In DepthDetails ArticlePubMed