BDBM50173148 4-[3,5-Dibromo-4-(2-chloro-6-fluoro-benzyloxy)-phenylcarbamoyl]-2,5-dihydro-thiophene-3-carboxylic acid::CHEMBL194776
SMILES OC(=O)C1=C(CSC1)C(=O)Nc1cc(Br)c(OCc2c(F)cccc2Cl)c(Br)c1
InChI Key InChIKey=VCQPZLVKNCRCMJ-UHFFFAOYSA-N
Data  1 IC50
  Tab Delimited (TSV)   2D SDfile   Computed 3D by Vconf -m prep SDfile
Find this compound or compounds like it in BindingDB:
Activity Spreadsheet -- Enzyme Inhibition Constant Data from BindingDB
Found 1 hit for monomerid = 50173148
TargetDihydroorotate dehydrogenase (quinone), mitochondrial(Homo sapiens (Human))
4Sc
Curated by ChEMBL
LigandPNGBDBM50173148(4-[3,5-Dibromo-4-(2-chloro-6-fluoro-benzyloxy)-phe...)
Affinity DataIC50:  105nM. Assay description: Inhibition of N-terminally truncated recombinant human dihydroorotate dehydrogenase using in vitro enzyme assay
In DepthDetails ArticlePubMed