BDBM50173157 4-(Biphenyl-4-ylcarbamoyl)-2,5-dihydro-thiophene-3-carboxylic acid::CHEMBL372101
SMILES OC(=O)C1=C(CSC1)C(=O)Nc1ccc(cc1)-c1ccccc1
InChI Key InChIKey=OSHPEKARXXEJSE-UHFFFAOYSA-N
Data  1 IC50
  Tab Delimited (TSV)   2D SDfile   Computed 3D by Vconf -m prep SDfile
Find this compound or compounds like it in BindingDB:
Activity Spreadsheet -- Enzyme Inhibition Constant Data from BindingDB
Found 1 hit for monomerid = 50173157
TargetDihydroorotate dehydrogenase (quinone), mitochondrial(Homo sapiens (Human))
4Sc
Curated by ChEMBL
LigandPNGBDBM50173157(4-(Biphenyl-4-ylcarbamoyl)-2,5-dihydro-thiophene-3...)
Affinity DataIC50:  667nM. Assay description: Inhibition of N-terminally truncated recombinant human dihydroorotate dehydrogenase using in vitro enzyme assay
In DepthDetails ArticlePubMed