BDBM50173380 CHEMBL372733::N-Ethyl-2-(4-methanesulfonyl-phenyl)-N-{1-[3-phenyl-3-(4-phenylmethanesulfonylamino-phenyl)-propyl]-piperidin-4-yl}-acetamide
SMILES CCN(C1CCN(CCC(c2ccccc2)c2ccc(NS(=O)(=O)Cc3ccccc3)cc2)CC1)C(=O)Cc1ccc(cc1)S(C)(=O)=O
InChI Key InChIKey=WXPALFNOHPEXQH-UHFFFAOYSA-N
Data  1 IC50
  Tab Delimited (TSV)   2D SDfile   Computed 3D by Vconf -m prep SDfile
Find this compound or compounds like it in BindingDB:
Activity Spreadsheet -- Enzyme Inhibition Constant Data from BindingDB
Found 1 hit for monomerid = 50173380
TargetC-C chemokine receptor type 5(Homo sapiens (Human))
Astrazeneca
Curated by ChEMBL
LigandPNGBDBM50173380(CHEMBL372733 | N-Ethyl-2-(4-methanesulfonyl-phenyl...)
Affinity DataIC50:  11nM. Assay description: Displacement of [125I]-MIP-1 alpha from human C-C chemokine receptor type 5 expressed in CHO cells
In DepthDetails ArticlePubMed