BDBM50173499 CHEMBL3808581
SMILES Cc1cnn2ccc(nc12)-c1ccc(OC(F)(F)F)cc1
InChI Key InChIKey=KBVZVELFNIGUIP-UHFFFAOYSA-N
Data  1 IC50
  Tab Delimited (TSV)   2D SDfile   Computed 3D by Vconf -m prep SDfile
Find this compound or compounds like it in BindingDB:
Activity Spreadsheet -- Enzyme Inhibition Constant Data from BindingDB
Found 1 hit for monomerid = 50173499
TargetSodium channel protein type 5 subunit alpha(Homo sapiens (Human))
Gilead Sciences
Curated by ChEMBL
LigandPNGBDBM50173499(CHEMBL3808581)
Affinity DataIC50:  5.05E+3nM. Assay description: Inhibition of Nav 1.5 (unknown origin) assessed as reduction in late channel current
In DepthDetails ArticlePubMed