BDBM50173517 3,5-dimethyl-4-hydroxy-5-octyl-5H-thiophen-2-one::4-Hydroxy-3,5-dimethyl-5-octyl-5H-thiophen-2-one::CHEMBL196776
SMILES CCCCCCCCC1(C)SC(=O)C(C)C1=O
InChI Key InChIKey=WQJGODZWMFTIGC-UHFFFAOYSA-N
Data  2 IC50
  Tab Delimited (TSV)   2D SDfile   Computed 3D by Vconf -m prep SDfile
Find this compound or compounds like it in BindingDB:
Activity Spreadsheet -- Enzyme Inhibition Constant Data from BindingDB
Found 2 hits for monomerid = 50173517
Target3-oxoacyl-[acyl-carrier-protein] synthase 3(Mycobacterium tuberculosis)
National Institute Of Allergy And Infectious Diseases
Curated by ChEMBL
LigandPNGBDBM50173517(3,5-dimethyl-4-hydroxy-5-octyl-5H-thiophen-2-one |...)
Affinity DataIC50: >1.00E+5nM. Assay description: Inhibitory activity against FabH from Mycobacterium tuberculosis H37Rv
In DepthDetails ArticlePubMed
Target3-oxoacyl-[acyl-carrier-protein] synthase 3(Escherichia coli)
National Institute Of Allergy And Infectious Diseases
Curated by ChEMBL
LigandPNGBDBM50173517(3,5-dimethyl-4-hydroxy-5-octyl-5H-thiophen-2-one |...)
Affinity DataIC50: >1.00E+5nM. Assay description: Inhibitory activity against FabH from Escherichia coli ANSI
In DepthDetails ArticlePubMed