BDBM50173581 CHEMBL3809644
SMILES Cc1ccccc1N1CCN(CC1)c1ccc(cc1NC(=O)c1coc(n1)C1CC1)C(=O)N[C@H]1CCC[C@H](O)C1
InChI Key InChIKey=ROUHJDSXZMCIMV-ZEQRLZLVSA-N
Data  1 EC50
  Tab Delimited (TSV)   2D SDfile   Computed 3D by Vconf -m prep SDfile
Find this compound or compounds like it in BindingDB:
Activity Spreadsheet -- Enzyme Inhibition Constant Data from BindingDB
Found 1 hit for monomerid = 50173581
TargetFollicle-stimulating hormone receptor(Homo sapiens (Human))
Therachem Research Medilab (India)
Curated by ChEMBL
LigandPNGBDBM50173581(CHEMBL3809644)
Affinity DataEC50: <100nM. Assay description: Positive allosteric modulation of FSHR (unknown origin) expressed in CHO cells assessed as FSH-induced cAMP accumulation incubated for 1 hr by HTRF a...
In DepthDetails ArticlePubMed