BDBM50173593 CHEMBL3809715
SMILES CC(C)(C)c1cc(NC(=O)Nc2ccc(cc2)-c2cc(N)no2)no1
InChI Key InChIKey=SERSHILIOMDFAS-UHFFFAOYSA-N
Data  1 IC50
  Tab Delimited (TSV)   2D SDfile   Computed 3D by Vconf -m prep SDfile
Find this compound or compounds like it in BindingDB:
Activity Spreadsheet -- Enzyme Inhibition Constant Data from BindingDB
Found 1 hit for monomerid = 50173593
TargetVascular endothelial growth factor receptor 2(Homo sapiens (Human))
Novartis Institutes For Biomedical Research
Curated by ChEMBL
LigandPNGBDBM50173593(CHEMBL3809715)
Affinity DataIC50: >1.00E+4nM. Assay description: Inhibition of KDR (unknown origin)
In DepthDetails ArticlePubMed