BDBM50173619 CHEMBL425909::N-{4-[2-Ethyl-4-(4-fluoro-phenyl)-thiazol-5-yl]-pyridin-2-yl}-benzamide
SMILES CCc1nc(c(s1)-c1ccnc(NC(=O)c2ccccc2)c1)-c1ccc(F)cc1
InChI Key InChIKey=ZOFLBKLKRCZRFS-UHFFFAOYSA-N
Data  1 IC50
  Tab Delimited (TSV)   2D SDfile   Computed 3D by Vconf -m prep SDfile
Find this compound or compounds like it in BindingDB:
Activity Spreadsheet -- Enzyme Inhibition Constant Data from BindingDB
Found 1 hit for monomerid = 50173619
TargetMitogen-activated protein kinase 14(Homo sapiens (Human))
Takeda Pharmaceutical
Curated by ChEMBL
LigandPNGBDBM50173619(CHEMBL425909 | N-{4-[2-Ethyl-4-(4-fluoro-phenyl)-t...)
Affinity DataIC50:  31nM. Assay description: In vitro inhibitory activity against mitogen-activated protein kinase p38 alpha
In DepthDetails ArticlePubMed