BDBM50173785 (2-Biphenyl-3-yl-1-phosphono-ethyl)-phosphonic acid::CHEMBL371264
SMILES OP(O)(=O)C(Cc1cccc(c1)-c1ccccc1)P(O)(O)=O
InChI Key InChIKey=XCXCXMPYBASLQO-UHFFFAOYSA-N
Data  1 IC50
  Tab Delimited (TSV)   2D SDfile   Computed 3D by Vconf -m prep SDfile
Find this compound or compounds like it in BindingDB:
Activity Spreadsheet -- Enzyme Inhibition Constant Data from BindingDB
Found 1 hit for monomerid = 50173785
TargetH(+)-exporting diphosphatase(Trypanosoma brucei)
University Of Illinois At Urbana-Champaign
Curated by ChEMBL
LigandPNGBDBM50173785((2-Biphenyl-3-yl-1-phosphono-ethyl)-phosphonic aci...)
Affinity DataIC50:  5.23E+4nM. Assay description: Inhibition of recombinant Trypanosoma brucei soluble vacuolar pyrophosphatase expressed in Escherichia coli
In DepthDetails ArticlePubMed