BDBM50173824 1-[3-{2-[1-(1-adamantyl)ethyl]-1H-4-imidazolyl}-2-[5-oxo-(2S)-tetrahydro-1H-2-pyrrolylcarboxamido]-(2S)-propanoyl]-(2S)-tetrahydro-1H-2-pyrrolecarboxamide::CHEMBL369944
SMILES NC(=O)[C@@H]1CCCN1C(=O)[C@H](Cc1cnc([nH]1)C12CC3CC(CC(C3)C1)C2)NC(=O)[C@@H]1CCC(=O)N1
InChI Key InChIKey=HLSSOACOJFPTPF-UQOYHGSASA-N
Data  2 KI  2 EC50
  Tab Delimited (TSV)   2D SDfile   Computed 3D by Vconf -m prep SDfile
Find this compound or compounds like it in BindingDB:
Activity Spreadsheet -- Enzyme Inhibition Constant Data from BindingDB
Found 4 hits for monomerid = 50173824
TargetThyrotropin-releasing hormone receptor(Rattus norvegicus)
National Institute Of Pharmaceutical Education And Research
Curated by ChEMBL
LigandPNGBDBM50173824(1-[3-{2-[1-(1-adamantyl)ethyl]-1H-4-imidazolyl}-2-...)
Affinity DataKi: >1.00E+5nMpH: 7.4Assay Description:Inhibitory constant against thyrotropin releasing hormone receptor 1 expressed in HEK 293EM cells upon incubation at 37 degee C for 1 hr at pH 7.4 us...
In DepthDetails ArticlePubMed
TargetThyrotropin-releasing hormone receptor(Rattus norvegicus)
National Institute Of Pharmaceutical Education And Research
Curated by ChEMBL
LigandPNGBDBM50173824(1-[3-{2-[1-(1-adamantyl)ethyl]-1H-4-imidazolyl}-2-...)
Affinity DataKi: >1.00E+5nMpH: 7.4Assay Description:Inhibitory constant against thyrotropin releasing hormone receptor 2 expressed in HEK 293EM cells upon incubation at 37 degee C for 1 hr at pH 7.4 us...
In DepthDetails ArticlePubMed
TargetThyrotropin-releasing hormone receptor(Rattus norvegicus)
National Institute Of Pharmaceutical Education And Research
Curated by ChEMBL
LigandPNGBDBM50173824(1-[3-{2-[1-(1-adamantyl)ethyl]-1H-4-imidazolyl}-2-...)
Affinity DataEC50: >1.00E+5nMpH: 7.8Assay Description:Signaling (activation) potency for thyrotropin releasing hormone receptor 1 expressed in HEK 293EM cells with CREB-luciferase reporter upon incubatio...
In DepthDetails ArticlePubMed
TargetThyrotropin-releasing hormone receptor(Rattus norvegicus)
National Institute Of Pharmaceutical Education And Research
Curated by ChEMBL
LigandPNGBDBM50173824(1-[3-{2-[1-(1-adamantyl)ethyl]-1H-4-imidazolyl}-2-...)
Affinity DataEC50: >1.00E+5nMpH: 7.8Assay Description:Signaling (activation) potency for thyrotropin releasing hormone receptor 2 expressed in HEK 293EM cells with CREB-luciferase reporter upon incubatio...
In DepthDetails ArticlePubMed