BDBM50173828 1-[2-[5-oxo-(2S)-tetrahydro-1H-2-pyrrolylcarboxamido]-3-(2-propyl-1H-4-imidazolyl)-(2S)-propanoyl]-(2S)-tetrahydro-1H-2-pyrrolecarboxamide::CHEMBL197149
SMILES CCCc1ncc(C[C@H](NC(=O)[C@@H]2CCC(=O)N2)C(=O)N2CCC[C@H]2C(N)=O)[nH]1
InChI Key InChIKey=VCHKQAATQKNCAO-IHRRRGAJSA-N
Data  2 KI  2 EC50
  Tab Delimited (TSV)   2D SDfile   Computed 3D by Vconf -m prep SDfile
Find this compound or compounds like it in BindingDB:
Activity Spreadsheet -- Enzyme Inhibition Constant Data from BindingDB
Found 4 hits for monomerid = 50173828
TargetThyrotropin-releasing hormone receptor(Rattus norvegicus)
National Institute Of Pharmaceutical Education And Research
Curated by ChEMBL
LigandPNGBDBM50173828(1-[2-[5-oxo-(2S)-tetrahydro-1H-2-pyrrolylcarboxami...)
Affinity DataKi:  320nMpH: 7.4Assay Description:Inhibitory constant against thyrotropin releasing hormone receptor 1 expressed in HEK 293EM cells upon incubation at 37 degee C for 1 hr at pH 7.4 us...
In DepthDetails ArticlePubMed
TargetThyrotropin-releasing hormone receptor(Rattus norvegicus)
National Institute Of Pharmaceutical Education And Research
Curated by ChEMBL
LigandPNGBDBM50173828(1-[2-[5-oxo-(2S)-tetrahydro-1H-2-pyrrolylcarboxami...)
Affinity DataKi:  1.70E+4nMpH: 7.4Assay Description:Inhibitory constant against thyrotropin releasing hormone receptor 2 expressed in HEK 293EM cells upon incubation at 37 degee C for 1 hr at pH 7.4 us...
In DepthDetails ArticlePubMed
TargetThyrotropin-releasing hormone receptor(Rattus norvegicus)
National Institute Of Pharmaceutical Education And Research
Curated by ChEMBL
LigandPNGBDBM50173828(1-[2-[5-oxo-(2S)-tetrahydro-1H-2-pyrrolylcarboxami...)
Affinity DataEC50:  290nMpH: 7.8Assay Description:Signaling (activation) potency for thyrotropin releasing hormone receptor 1 expressed in HEK 293EM cells with CREB-luciferase reporter upon incubatio...
In DepthDetails ArticlePubMed
TargetThyrotropin-releasing hormone receptor(Rattus norvegicus)
National Institute Of Pharmaceutical Education And Research
Curated by ChEMBL
LigandPNGBDBM50173828(1-[2-[5-oxo-(2S)-tetrahydro-1H-2-pyrrolylcarboxami...)
Affinity DataEC50:  24nMpH: 7.8Assay Description:Signaling (activation) potency for thyrotropin releasing hormone receptor 2 expressed in HEK 293EM cells with CREB-luciferase reporter upon incubatio...
In DepthDetails ArticlePubMed