BDBM50173913 (2-Hydroxy-ethyl)-carbamic acid (4E,6Z)-(13S,14S,17R,19S)-19-(2-dimethylamino-ethylamino)-13-(S)-hydroxy-8,14-dimethoxy-4,12,16-trimethyl-10-(R)-methyl-3,20,22-trioxo-2-aza-bicyclo[16.3.1]docosa-1(21),4,6,10,18-pentaen-9-yl ester::CHEMBL381213
SMILES CO[C@H]1C[C@H](C)Cc2c(O)c(NC(=O)C(C)=CC=C[C@H](OC)[C@@H](OC(=O)NCCO)\C(C)=C\[C@H](C)[C@H]1O)cc(O)c2N=CCN(C)C
InChI Key InChIKey=MCWMWWXVRLYWEZ-YXRZDTIZSA-N
Data  1 Kd
  Tab Delimited (TSV)   2D SDfile   Computed 3D by Vconf -m prep SDfile
Find this compound or compounds like it in BindingDB:
Activity Spreadsheet -- Enzyme Inhibition Constant Data from BindingDB
Found 1 hit for monomerid = 50173913
TargetHeat shock protein HSP 90-alpha(Homo sapiens (Human))
Kosan Biosciences
Curated by ChEMBL
LigandPNGBDBM50173913((2-Hydroxy-ethyl)-carbamic acid (4E,6Z)-(13S,14S,1...)
Affinity DataKd: >1.00E+5nM. Assay description: Binding affinity for human heat shock protein 90 in scintillation proximity assay
In DepthDetails ArticlePubMed