BDBM50174 1-[(Z)-(2-methyl-3-indolylidene)methyl]-2-(4-nitrophenyl)hydrazine::1-[(Z)-(2-methylindol-3-ylidene)methyl]-2-(4-nitrophenyl)diazane::1-[(Z)-(2-methylindol-3-ylidene)methyl]-2-(4-nitrophenyl)hydrazine::2-methyl-1H-indole-3-carbaldehyde (4-nitrophenyl)hydrazone::MLS000575501::SMR000184751::cid_5337812
SMILES Cc1[n-]c2ccccc2c1C[NH+]=Nc1ccc(cc1)[N+]([O-])=O
InChI Key InChIKey=UFPGPIXXSJXINT-UHFFFAOYSA-O
Data  1 IC50
  Tab Delimited (TSV)   2D SDfile   Computed 3D by Vconf -m prep SDfile
Find this compound or compounds like it in BindingDB:
Activity Spreadsheet -- Enzyme Inhibition Constant Data from BindingDB
Found 1 hit for monomerid = 50174
TargetInduced myeloid leukemia cell differentiation protein Mcl-1(Homo sapiens (Human))
Emory University
Curated by PubChem BioAssay
LigandPNGBDBM50174(1-[(Z)-(2-methyl-3-indolylidene)methyl]-2-(4-nitro...)
Affinity DataIC50:  400nM. Assay description: NIH Molecular Libraries Screening Centers Network [MLSCN] Emory Chemical Biology Discovery Center in MLSCN Assay provider: Nikolovska-Coleska, Univer...
In DepthDetails PCBioAssay