BDBM50174756 3-chloro-4-(4-chloro-2-hydroxyphenoxy)benzoic acid::CHEMBL196818
SMILES OC(=O)c1ccc(Oc2ccc(Cl)cc2O)c(Cl)c1
InChI Key InChIKey=LKZDVLPYGVEGKW-UHFFFAOYSA-N
Data  1 IC50
  Tab Delimited (TSV)   2D SDfile   Computed 3D by Vconf -m prep SDfile
Find this compound or compounds like it in BindingDB:
Activity Spreadsheet -- Enzyme Inhibition Constant Data from BindingDB
Found 1 hit for monomerid = 50174756
TargetEnoyl-acyl-carrier protein reductase(Plasmodium falciparum)
Jacobus Pharmaceutical
Curated by ChEMBL
LigandPNGBDBM50174756(3-chloro-4-(4-chloro-2-hydroxyphenoxy)benzoic acid...)
Affinity DataIC50:  550nM. Assay description: Inhibition of PfENR enzymatic activity
In DepthDetails ArticlePubMed