BDBM50174762 3-chloro-4-(4-chloro-2-hydroxyphenoxy)-N-hydroxybenzamide::CHEMBL200514
SMILES ONC(=O)c1ccc(Oc2ccc(Cl)cc2O)c(Cl)c1
InChI Key InChIKey=NDRKLRUEEPVRJG-UHFFFAOYSA-N
Data  1 IC50
  Tab Delimited (TSV)   2D SDfile   Computed 3D by Vconf -m prep SDfile
Find this compound or compounds like it in BindingDB:
Activity Spreadsheet -- Enzyme Inhibition Constant Data from BindingDB
Found 1 hit for monomerid = 50174762
TargetEnoyl-acyl-carrier protein reductase(Plasmodium falciparum)
Jacobus Pharmaceutical
Curated by ChEMBL
LigandPNGBDBM50174762(3-chloro-4-(4-chloro-2-hydroxyphenoxy)-N-hydroxybe...)
Affinity DataIC50:  1.20E+3nM. Assay description: Inhibition of PfENR enzymatic activity
In DepthDetails ArticlePubMed