BDBM50174763 3-chloro-4-(4-chloro-2-hydroxyphenoxy)-N,N-dimethylbenzamide::CHEMBL200308
SMILES CN(C)C(=O)c1ccc(Oc2ccc(Cl)cc2O)c(Cl)c1
InChI Key InChIKey=QZOASPWPMMTSJQ-UHFFFAOYSA-N
Data  1 IC50
  Tab Delimited (TSV)   2D SDfile   Computed 3D by Vconf -m prep SDfile
Find this compound or compounds like it in BindingDB:
Activity Spreadsheet -- Enzyme Inhibition Constant Data from BindingDB
Found 1 hit for monomerid = 50174763
TargetEnoyl-acyl-carrier protein reductase(Plasmodium falciparum)
Jacobus Pharmaceutical
Curated by ChEMBL
LigandPNGBDBM50174763(3-chloro-4-(4-chloro-2-hydroxyphenoxy)-N,N-dimethy...)
Affinity DataIC50:  460nM. Assay description: Inhibition of PfENR enzymatic activity
In DepthDetails ArticlePubMed