BDBM50174828 3-(3-chloro-4-fluoro-phenyl)-1-(3'-cyano-biphenyl-4-ylmethyl)-1-(3-pyrrolidin-1-yl-propyl)-urea::CHEMBL197429
SMILES Fc1ccc(NC(=O)N(CCCN2CCCC2)Cc2ccc(cc2)-c2cccc(c2)C#N)cc1Cl
InChI Key InChIKey=BPFHLARZSZGTAE-UHFFFAOYSA-N
Data  2 KI
  Tab Delimited (TSV)   2D SDfile   Computed 3D by Vconf -m prep SDfile
Find this compound or compounds like it in BindingDB:
Activity Spreadsheet -- Enzyme Inhibition Constant Data from BindingDB
Found 2 hits for monomerid = 50174828
TargetMelanin-concentrating hormone receptor 1(Homo sapiens (Human))
Schering-Plough Research Institute
Curated by ChEMBL
LigandPNGBDBM50174828(3-(3-chloro-4-fluoro-phenyl)-1-(3'-cyano-biphenyl-...)
Affinity DataKi:  48nM. Assay description: Antagonist activity against human MCH1 receptor
In DepthDetails ArticlePubMed
TargetMelanin-concentrating hormone receptor 2(Homo sapiens (Human))
Schering-Plough Research Institute
Curated by ChEMBL
LigandPNGBDBM50174828(3-(3-chloro-4-fluoro-phenyl)-1-(3'-cyano-biphenyl-...)
Affinity DataKi: >3.00E+3nM. Assay description: Antagonist activity against human MCH2 receptor
In DepthDetails ArticlePubMed