BDBM50174853 CHEMBL199217::rac-N-((3-(9-chloro-3-methyl-4-oxoisoxazolo[4,3-c]quinolin-5(4H)-yl)cyclohexyl)methyl)benzamide
SMILES Cc1onc2c1c(=O)n([C@H]1CCC[C@H](CNC(=O)c3ccccc3)C1)c1cccc(Cl)c21
InChI Key InChIKey=UTSANVQWUWLEDP-WMZOPIPTSA-N
Data  1 IC50  1 EC50
  Tab Delimited (TSV)   2D SDfile   Computed 3D by Vconf -m prep SDfile
Find this compound or compounds like it in BindingDB:
Activity Spreadsheet -- Enzyme Inhibition Constant Data from BindingDB
Found 2 hits for monomerid = 50174853
TargetMultidrug resistance-associated protein 1(Homo sapiens (Human))
Eli Lilly
Curated by ChEMBL
LigandPNGBDBM50174853(CHEMBL199217 | rac-N-((3-(9-chloro-3-methyl-4-oxoi...)
Affinity DataIC50:  1.01E+3nM. Assay description: Inhibitory activity against MRP1-mediated LTC4 uptake into membrane vesicles from HeLa-T5 cells expressing MRP1
In DepthDetails ArticlePubMed
TargetMultidrug resistance-associated protein 1(Homo sapiens (Human))
Eli Lilly
Curated by ChEMBL
LigandPNGBDBM50174853(CHEMBL199217 | rac-N-((3-(9-chloro-3-methyl-4-oxoi...)
Affinity DataEC50:  640nM. Assay description: Inhibitory activity against MRP1 in HeLa-T5 cells
In DepthDetails ArticlePubMed