BDBM50175 (E)-3-(2-chlorophenyl)-N-[4-(dimethylamino)phenyl]-2-propenamide::(E)-3-(2-chlorophenyl)-N-[4-(dimethylamino)phenyl]acrylamide::(E)-3-(2-chlorophenyl)-N-[4-(dimethylamino)phenyl]prop-2-enamide::MLS000578805::SMR000186594::cid_723732
SMILES CN(C)c1ccc(NC(=O)\C=C\c2ccccc2Cl)cc1
InChI Key InChIKey=UKOTXFBQQFYGOI-KPKJPENVSA-N
Data  1 IC50
  Tab Delimited (TSV)   2D SDfile   Computed 3D by Vconf -m prep SDfile
Find this compound or compounds like it in BindingDB:
Activity Spreadsheet -- Enzyme Inhibition Constant Data from BindingDB
Found 1 hit for monomerid = 50175
TargetInduced myeloid leukemia cell differentiation protein Mcl-1(Homo sapiens (Human))
Emory University
Curated by PubChem BioAssay
LigandPNGBDBM50175((E)-3-(2-chlorophenyl)-N-[4-(dimethylamino)phenyl]...)
Affinity DataIC50:  5.40E+4nM. Assay description: NIH Molecular Libraries Screening Centers Network [MLSCN] Emory Chemical Biology Discovery Center in MLSCN Assay provider: Nikolovska-Coleska, Univer...
In DepthDetails PCBioAssay