BDBM50175366 (R)-2-chloro-6-(2-hydroxy-3-(2-(naphthalen-2-yl)ethylamino)propoxy)benzonitrile::CHEMBL372821
SMILES O[C@H](CNCCc1ccc2ccccc2c1)COc1cccc(Cl)c1C#N
InChI Key InChIKey=SLUDXVDILMLNPE-LJQANCHMSA-N
Data  1 IC50
  Tab Delimited (TSV)   2D SDfile   Computed 3D by Vconf -m prep SDfile
Find this compound or compounds like it in BindingDB:
Activity Spreadsheet -- Enzyme Inhibition Constant Data from BindingDB
Found 1 hit for monomerid = 50175366
TargetExtracellular calcium-sensing receptor(Homo sapiens (Human))
Bristol-Myers Squibb Pharmaceutical Research Institute
Curated by ChEMBL
LigandPNGBDBM50175366((R)-2-chloro-6-(2-hydroxy-3-(2-(naphthalen-2-yl)et...)
Affinity DataIC50:  3.86E+3nM. Assay description: Inhibition of intracellular calcium release in human TT cells containing calcium-sensing receptor by FLIPR
In DepthDetails ArticlePubMed