BDBM50175383 (R)-1-(1-(4-fluorophenyl)-2-methylpropan-2-ylamino)-3-(4-(trifluoromethoxy)phenoxy)propan-2-ol::CHEMBL201065
SMILES CC(C)(Cc1ccc(F)cc1)NC[C@@H](O)COc1ccc(OC(F)(F)F)cc1
InChI Key InChIKey=FRVZDYYYHDHDGQ-MRXNPFEDSA-N
Data  1 IC50
  Tab Delimited (TSV)   2D SDfile   Computed 3D by Vconf -m prep SDfile
Find this compound or compounds like it in BindingDB:
Activity Spreadsheet -- Enzyme Inhibition Constant Data from BindingDB
Found 1 hit for monomerid = 50175383
TargetExtracellular calcium-sensing receptor(Homo sapiens (Human))
Bristol-Myers Squibb Pharmaceutical Research Institute
Curated by ChEMBL
LigandPNGBDBM50175383((R)-1-(1-(4-fluorophenyl)-2-methylpropan-2-ylamino...)
Affinity DataIC50:  3.30E+3nM. Assay description: Inhibition of intracellular calcium release in human TT cells containing calcium-sensing receptor by FLIPR
In DepthDetails ArticlePubMed