BDBM50175557 CHEMBL194570::N-Hydroxy-2-[4-(pyridin-4-yloxy)-benzenesulfonylamino]-acetamide
SMILES ONC(=O)CNS(=O)(=O)c1ccc(Oc2ccncc2)cc1
InChI Key InChIKey=CBDJJSLRBITOQA-UHFFFAOYSA-N
Data  1 KI
  Tab Delimited (TSV)   2D SDfile   Computed 3D by Vconf -m prep SDfile
Find this compound or compounds like it in BindingDB:
Activity Spreadsheet -- Enzyme Inhibition Constant Data from BindingDB
Found 1 hit for monomerid = 50175557
TargetInterstitial collagenase(Homo sapiens (Human))
De Novo Pharmaceuticals
Curated by ChEMBL
LigandPNGBDBM50175557(CHEMBL194570 | N-Hydroxy-2-[4-(pyridin-4-yloxy)-be...)
Affinity DataKi:  8.20nM. Assay description: Binding affinity towards (MMP-1) matrix metalloproteinase-1
In DepthDetails ArticlePubMed