BDBM50175846 4-((1H-imidazol-4-yl)methyl)-1-(3-(3-chlorophenoxy)propyl)piperidine::CHEMBL200268
SMILES Clc1cccc(OCCCN2CCC(Cc3cnc[nH]3)CC2)c1
InChI Key InChIKey=NTZNXGDCVGYNSB-UHFFFAOYSA-N
Data  1 KI
  Tab Delimited (TSV)   2D SDfile   Computed 3D by Vconf -m prep SDfile
Find this compound or compounds like it in BindingDB:
Activity Spreadsheet -- Enzyme Inhibition Constant Data from BindingDB
Found 1 hit for monomerid = 50175846
TargetHistamine H3 receptor(GUINEA PIG)
The Schering Plough Research Institute
Curated by ChEMBL
LigandPNGBDBM50175846(4-((1H-imidazol-4-yl)methyl)-1-(3-(3-chlorophenoxy...)
Affinity DataKi:  2nM. Assay description: Displacement of [3H]-N-alpha-methylhistamine from histamine H3 receptor in guinea pig brain
In DepthDetails ArticlePubMed