BDBM50175910 1-(4-fluoro-phenyl)-8-((1S,2S)-2-phenyl-cyclohexyl)-1,3,8-triaza-spiro[4.5]decan-4-one::CHEMBL370111
SMILES Fc1ccc(cc1)N1CNC(=O)C11CCN(CC1)[C@H]1CCCC[C@H]1c1ccccc1
InChI Key InChIKey=HIOFFNLYGYBMSJ-GOTSBHOMSA-N
Data  2 EC50
  Tab Delimited (TSV)   2D SDfile   Computed 3D by Vconf -m prep SDfile
Find this compound or compounds like it in BindingDB:
Activity Spreadsheet -- Enzyme Inhibition Constant Data from BindingDB
Found 2 hits for monomerid = 50175910
TargetSodium- and chloride-dependent glycine transporter 2(Homo sapiens (Human))
F. Hoffmann-La Roche
Curated by ChEMBL
LigandPNGBDBM50175910(1-(4-fluoro-phenyl)-8-((1S,2S)-2-phenyl-cyclohexyl...)
Affinity DataEC50:  2.30E+4nM. Assay description: Inhibition of [3H]glycine uptake in cells transfected with human GlyT2 cDNA
In DepthDetails ArticlePubMed
TargetSodium- and chloride-dependent glycine transporter 1(Homo sapiens (Human))
F. Hoffmann-La Roche
Curated by ChEMBL
LigandPNGBDBM50175910(1-(4-fluoro-phenyl)-8-((1S,2S)-2-phenyl-cyclohexyl...)
Affinity DataEC50:  24nM. Assay description: Inhibition of [3H]glycine uptake in cells transfected with human GlyT1 cDNA
In DepthDetails ArticlePubMed