BDBM50176297 CHEMBL199403::ethyl 6,6-dimethyl-2-(3-(1-methyl-1H-pyrazol-5-ylsulfonyl)ureido)-4,5,6,7-tetrahydrobenzo[b]thiophene-3-carboxylate
SMILES CCOC(=O)c1c(NC(=O)NS(=O)(=O)c2ccnn2C)sc2CC(C)(C)CCc12
InChI Key InChIKey=QCXRGTRTXDAYSS-UHFFFAOYSA-N
Data  2 IC50
  Tab Delimited (TSV)   2D SDfile   Computed 3D by Vconf -m prep SDfile
Find this compound or compounds like it in BindingDB:
Activity Spreadsheet -- Enzyme Inhibition Constant Data from BindingDB
Found 2 hits for monomerid = 50176297
TargetRNA-directed RNA polymerase(Hepatitis C virus)
Viropharma
Curated by ChEMBL
LigandPNGBDBM50176297(CHEMBL199403 | ethyl 6,6-dimethyl-2-(3-(1-methyl-1...)
Affinity DataIC50:  50nM. Assay description: Inhibitory activity against HCV 4a NS5B full length RNA dependent RNA polymerase
In DepthDetails ArticlePubMed
TargetRNA-directed RNA polymerase(Hepatitis C virus)
Viropharma
Curated by ChEMBL
LigandPNGBDBM50176297(CHEMBL199403 | ethyl 6,6-dimethyl-2-(3-(1-methyl-1...)
Affinity DataIC50:  260nM. Assay description: Inhibitory activity against delta-21 C-terminally truncated HCV 1b (BB7 isolate) RNA dependent RNA polymerase
In DepthDetails ArticlePubMed