BDBM50176306 CHEMBL200327::ethyl 2-(3-(4-nitrophenylsulfonyl)ureido)-4,5,6,7-tetrahydrobenzo[b]thiophene-3-carboxylate
SMILES CCOC(=O)c1c(NC(=O)NS(=O)(=O)c2ccc(cc2)[N+]([O-])=O)sc2CCCCc12
InChI Key InChIKey=GKVLNEIANLMABO-UHFFFAOYSA-N
Data  1 IC50
  Tab Delimited (TSV)   2D SDfile   Computed 3D by Vconf -m prep SDfile
Find this compound or compounds like it in BindingDB:
Activity Spreadsheet -- Enzyme Inhibition Constant Data from BindingDB
Found 1 hit for monomerid = 50176306
TargetRNA-directed RNA polymerase(Hepatitis C virus)
Viropharma
Curated by ChEMBL
LigandPNGBDBM50176306(CHEMBL200327 | ethyl 2-(3-(4-nitrophenylsulfonyl)u...)
Affinity DataIC50:  2.80E+3nM. Assay description: Inhibitory activity against HCV 4a NS5B full length RNA dependent RNA polymerase
In DepthDetails ArticlePubMed