BDBM50176349 CHEMBL3808743
SMILES Fc1ccccc1C(F)(F)S(=O)(=O)n1ccc(NC(=O)c2ccccn2)c1
InChI Key InChIKey=UTQZESSHQPGOEC-UHFFFAOYSA-N
Data  2 EC50
  Tab Delimited (TSV)   2D SDfile   Computed 3D by Vconf -m prep SDfile
Find this compound or compounds like it in BindingDB:
Activity Spreadsheet -- Enzyme Inhibition Constant Data from BindingDB
Found 2 hits for monomerid = 50176349
TargetMetabotropic glutamate receptor 4(Homo sapiens (Human))
Vanderbilt University Medical Center
Curated by ChEMBL
LigandPNGBDBM50176349(CHEMBL3808743)
Affinity DataEC50: <3.16E+4nM. Assay description: Positive allosteric modulation of human mGlu4 receptor assessed as increase in glutamate-induced calcium mobilization
In DepthDetails ArticlePubMed
TargetMetabotropic glutamate receptor 4(Homo sapiens (Human))
Vanderbilt University Medical Center
Curated by ChEMBL
LigandPNGBDBM50176349(CHEMBL3808743)
Affinity DataEC50: >3.00E+4nM. Assay description: Positive allosteric modulation of human mGlu4 receptor assessed as increase in glutamate-induced calcium mobilization
In DepthDetails ArticlePubMed