BDBM50176719 4-(3-methoxyquinuclidin-3-yl)-1,2-diphenylbut-3-yn-2-ol::CHEMBL373256
SMILES COC1(CN2CCC1CC2)C#CC(O)(Cc1ccccc1)c1ccccc1
InChI Key InChIKey=JHVGODZODVAJRI-UHFFFAOYSA-N
Data  2 KI
  Tab Delimited (TSV)   2D SDfile   Computed 3D by Vconf -m prep SDfile
Find this compound or compounds like it in BindingDB:
Activity Spreadsheet -- Enzyme Inhibition Constant Data from BindingDB
Found 2 hits for monomerid = 50176719
TargetMuscarinic acetylcholine receptor M3(Homo sapiens (Human))
Ucb Pharma
Curated by ChEMBL
LigandPNGBDBM50176719(4-(3-methoxyquinuclidin-3-yl)-1,2-diphenylbut-3-yn...)
Affinity DataKi:  40nM. Assay description: Binding affinity to human muscarinic M3 receptor
In DepthDetails ArticlePubMed
TargetMuscarinic acetylcholine receptor M2(Homo sapiens (Human))
Ucb Pharma
Curated by ChEMBL
LigandPNGBDBM50176719(4-(3-methoxyquinuclidin-3-yl)-1,2-diphenylbut-3-yn...)
Affinity DataKi:  251nM. Assay description: Binding affinity to human muscarinic M2 receptor
In DepthDetails ArticlePubMed