BDBM50176739 4-(3-((4-(2,6-dioxo-1,3-dipropyl-2,3,6,7-tetrahydro-1H-purin-8-yl)-1H-pyrazol-1-yl)methyl)-1,2,4-oxadiazol-5-yl)benzonitrile::CHEMBL199895
SMILES CCCn1c2nc([nH]c2c(=O)n(CCC)c1=O)-c1cnn(Cc2noc(n2)-c2ccc(cc2)C#N)c1
InChI Key InChIKey=AUMGXDRTMXHQMJ-UHFFFAOYSA-N
Data  4 KI
  Tab Delimited (TSV)   2D SDfile   Computed 3D by Vconf -m prep SDfile
Find this compound or compounds like it in BindingDB:
Activity Spreadsheet -- Enzyme Inhibition Constant Data from BindingDB
Found 4 hits for monomerid = 50176739
TargetAdenosine receptor A2b(Homo sapiens (Human))
Cv Therapeutics
Curated by ChEMBL
LigandPNGBDBM50176739(4-(3-((4-(2,6-dioxo-1,3-dipropyl-2,3,6,7-tetrahydr...)
Affinity DataKi:  14nM. Assay description: Displacement of [3H]ZM241385 from Adenosine A2B receptor expressed in HEK cells
In DepthDetails ArticlePubMed
TargetAdenosine receptor A1(Homo sapiens (Human))
Cv Therapeutics
Curated by ChEMBL
LigandPNGBDBM50176739(4-(3-((4-(2,6-dioxo-1,3-dipropyl-2,3,6,7-tetrahydr...)
Affinity DataKi:  570nM. Assay description: Displacement of [3H]CPX from Adenosine A1 receptor expressed in CHO cells
In DepthDetails ArticlePubMed
TargetAdenosine receptor A3(Homo sapiens (Human))
Cv Therapeutics
Curated by ChEMBL
LigandPNGBDBM50176739(4-(3-((4-(2,6-dioxo-1,3-dipropyl-2,3,6,7-tetrahydr...)
Affinity DataKi:  640nM. Assay description: Displacement of [125I]AB-MECA from Adenosine A3 receptor expressed in CHO cells
In DepthDetails ArticlePubMed
TargetAdenosine receptor A2a(Homo sapiens (Human))
Cv Therapeutics
Curated by ChEMBL
LigandPNGBDBM50176739(4-(3-((4-(2,6-dioxo-1,3-dipropyl-2,3,6,7-tetrahydr...)
Affinity DataKi: >5.00E+3nM. Assay description: Displacement of [3H]ZM241385 from Adenosine A2A receptor expressed in HEK cells
In DepthDetails ArticlePubMed