BDBM50176960 11-(3-hydroxyphenoxy)undecanoic acid (2-hydroxyethyl)amide::CHEMBL225358
SMILES OCCNC(=O)CCCCCCCCCCOc1cccc(O)c1
InChI Key InChIKey=JWPDWDOGYQTJJE-UHFFFAOYSA-N
Data  1 KI
  Tab Delimited (TSV)   2D SDfile   Computed 3D by Vconf -m prep SDfile
Find this compound or compounds like it in BindingDB:
Activity Spreadsheet -- Enzyme Inhibition Constant Data from BindingDB
Found 1 hit for monomerid = 50176960
TargetCannabinoid receptor 1(Homo sapiens (Human))
Universit£
Curated by ChEMBL
LigandPNGBDBM50176960(11-(3-hydroxyphenoxy)undecanoic acid (2-hydroxyeth...)
Affinity DataKi: >1.00E+4nM. Assay description: Displacement of [3H]CP-55940 from human CB1 receptor expressed in COS cells
In DepthDetails ArticlePubMed