BDBM50176993 CHEMBL3815076
SMILES CCc1ccc-2c(c1)C(Cc1cc(O)cc(C)c-21)c1ccc(OCCN2CCOCC2)cc1
InChI Key InChIKey=XDERAIFJPVTSRP-UHFFFAOYSA-N
Data  2 IC50
  Tab Delimited (TSV)   2D SDfile   Computed 3D by Vconf -m prep SDfile
Find this compound or compounds like it in BindingDB:
Activity Spreadsheet -- Enzyme Inhibition Constant Data from BindingDB
Found 2 hits for monomerid = 50176993
TargetEstrogen receptor beta(Homo sapiens (Human))
Swiss Federal Institute Of Technology (Eth)
Curated by ChEMBL
LigandPNGBDBM50176993(CHEMBL3815076)
Affinity DataIC50:  190nM. Assay description: Displacement of [3H]-17beta-estradiol from human recombinant ERbeta expressed in rabbit reticulocytes
In DepthDetails ArticlePubMed
TargetEstrogen receptor(Homo sapiens (Human))
Swiss Federal Institute Of Technology (Eth)
Curated by ChEMBL
LigandPNGBDBM50176993(CHEMBL3815076)
Affinity DataIC50:  9nM. Assay description: Displacement of [3H]-17beta-estradiol from human recombinant ERalpha expressed in rabbit reticulocytes
In DepthDetails ArticlePubMed