BDBM50177003 CHEMBL3813911
SMILES [#6]-[#6](-[#6])-[#6]-[#6](=O)-[#6]-1=[#6](-[#8])-[#6](-[#6]\[#6]=[#6](\[#6])-[#6])=[#6]2-[#8]-[#6@H](-[#6][C@@]2([#8])[#6]-1=O)C([#6])([#6])[#8]
InChI Key InChIKey=DXPAMBUYLZRLIJ-QVKFZJNVSA-N
Data  1 IC50
  Tab Delimited (TSV)   2D SDfile   Computed 3D by Vconf -m prep SDfile
Find this compound or compounds like it in BindingDB:
Activity Spreadsheet -- Enzyme Inhibition Constant Data from BindingDB
Found 1 hit for monomerid = 50177003
TargetPolyunsaturated fatty acid 5-lipoxygenase(Homo sapiens (Human))
University Of Naples Federico Ii
Curated by ChEMBL
LigandPNGBDBM50177003(CHEMBL3813911)
Affinity DataIC50: >1.00E+4nM. Assay description: Inhibition of recombinant human 5-LO expressed in Escherichia coli MV1190 cells preincubated for 10 mins followed by addition of arachidonic acid as ...
In DepthDetails ArticlePubMed