BDBM50177090 9-dimethylamino-3-(4-ethylphenyl)-3H-5-thia-1,3-diazafluoren-4-one::CHEMBL389918
SMILES CCc1ccc(cc1)-n1cnc2c(sc3cccc(N(C)C)c23)c1=O
InChI Key InChIKey=PNYBDVUFMGSQSL-UHFFFAOYSA-N
Data  2 IC50
  Tab Delimited (TSV)   2D SDfile   Computed 3D by Vconf -m prep SDfile
Find this compound or compounds like it in BindingDB:
Activity Spreadsheet -- Enzyme Inhibition Constant Data from BindingDB
Found 2 hits for monomerid = 50177090
TargetMetabotropic glutamate receptor 5(Homo sapiens (Human))
Abbott Laboratories
Curated by ChEMBL
LigandPNGBDBM50177090(9-dimethylamino-3-(4-ethylphenyl)-3H-5-thia-1,3-di...)
Affinity DataIC50: >1.00E+5nM. Assay description: Antagonist activity at human mGluR5 expressed in 1321N1 cells assessed as effect on L-glutamate-induced calcium mobilization
In DepthDetails ArticlePubMed
TargetMetabotropic glutamate receptor 1(Homo sapiens (Human))
Abbott Laboratories
Curated by ChEMBL
LigandPNGBDBM50177090(9-dimethylamino-3-(4-ethylphenyl)-3H-5-thia-1,3-di...)
Affinity DataIC50:  949nM. Assay description: Antagonist activity at human mGluR1 expressed in 1321N1 cells assessed as effect on L-glutamate-induced calcium mobilization
In DepthDetails ArticlePubMed