BDBM50177185 6-[6-(3-carbamimidoyl-phenoxy)-4-diisopropylamino-3,5-difluoro-pyridin-2-yloxy]-N-isobutyl-isophthalamic acid trifluoro-acetic acid::CHEMBL205123
SMILES CC(C)CNC(=O)c1ccc(Oc2nc(Oc3cccc(c3)C(N)=N)c(F)c(N(C(C)C)C(C)C)c2F)c(c1)C(O)=O
InChI Key InChIKey=JLWMMYZWEHHTFF-UHFFFAOYSA-N
Data  2 IC50
PDB links: 1 PDB ID matches this monomer.
  Tab Delimited (TSV)   2D SDfile   Computed 3D by Vconf -m prep SDfile
Find this compound or compounds like it in BindingDB:
Activity Spreadsheet -- Enzyme Inhibition Constant Data from BindingDB
Found 2 hits for monomerid = 50177185
TargetCoagulation factor VII/Tissue factor(Homo sapiens (Human))
Pfizer
Curated by ChEMBL
LigandPNGBDBM50177185(6-[6-(3-carbamimidoyl-phenoxy)-4-diisopropylamino-...)
Affinity DataIC50:  20nM. Assay description: Inhibition of human recombinant FVIIa/TF complex
TargetProthrombin(Homo sapiens (Human))
Pfizer
Curated by ChEMBL
LigandPNGBDBM50177185(6-[6-(3-carbamimidoyl-phenoxy)-4-diisopropylamino-...)
Affinity DataIC50:  1.20E+3nM. Assay description: Inhibition of FIIa
In DepthDetails ArticlePubMed