BDBM50177386 4-((3,5-bis(trifluoromethyl)benzyloxy)methyl)-4-(4-fluorophenyl)-1-(piperidin-4-yl)imidazolidin-2-one::CHEMBL379038
SMILES Fc1ccc(cc1)C1(COCc2cc(cc(c2)C(F)(F)F)C(F)(F)F)CN(C2CCNCC2)C(=O)N1
InChI Key InChIKey=PCROSQUDZNGXBN-UHFFFAOYSA-N
Data  1 KI
  Tab Delimited (TSV)   2D SDfile   Computed 3D by Vconf -m prep SDfile
Find this compound or compounds like it in BindingDB:
Activity Spreadsheet -- Enzyme Inhibition Constant Data from BindingDB
Found 1 hit for monomerid = 50177386
TargetSubstance-P receptor(Homo sapiens (Human))
Schering-Plough Research Institute
Curated by ChEMBL
LigandPNGBDBM50177386(4-((3,5-bis(trifluoromethyl)benzyloxy)methyl)-4-(4...)
Affinity DataKi:  0.900nM. Assay description: Displacement of [3H]-Sar-Met Substance P from recombinant human NK1 receptor in CHO cells
In DepthDetails ArticlePubMed